欢迎来到 DPDK交流社区 ,有什么问题可以尽管在这里提问,您将会收到社区其他成员的回答;也可以将您的总结写在这里,为社区其他成员提供帮助。 (QQ交流群:127163755)

DPDK安装问题./setup.sh

+1 投票
在DPDK中./setup.sh,选择x86_64-native-linuxapp-gcc进行编译时,出现

make: *** /lib/modules/3.10.0-123.el7.x86_64/build: No such file or directory.  Stop.
make[7]: *** [igb_uio.ko] Error 2
make[6]: *** [igb_uio] Error 2
make[5]: *** [linuxapp] Error 2
make[4]: *** [librte_eal] Error 2
make[3]: *** [lib] Error 2
make[2]: *** [all] Error 2
make[1]: *** [pre_install] Error 2
make: *** [install] Error 2

而我ls /usr/src/kernels/ ,目录下没东西,如何解决。
最新提问 10月 28, 2016 分类:DPDK初学入门 | 用户: lz (1,090 分)

2 个回答

+2 投票
 
已采纳
运行yum install kernel-devel即可~!
最新回答 10月 28, 2016 用户: lz (1,090 分)
0 投票

这是build链接错误,进入该目录下/lib/modules/3.10.0-123.el7.x86_64,删除原来的build,并重新添加链接就可以了image

最新回答 1月 18, 2017 用户: weicuidi (190 分)
...